Target
Sodium channel protein type 9 subunit alpha
Ligand
BDBM76858
Substrate
Meas. Tech.
ChEMBL_1822256 (CHEMBL4322020)
Kd
2.1±n/a nM
Citation
 Mulcahy, JVPajouhesh, HBeckley, JTDelwig, ADu Bois, JHunter, JC Challenges and Opportunities for Therapeutics Targeting the Voltage-Gated Sodium Channel Isoform Na J Med Chem 62:8695-8710 (2019)  
Target
Name:
Sodium channel protein type 9 subunit alpha
Synonyms:
Kiaa4197 Peripheral sodium channel 1 Scn9a Sodium channel protein type IX subunit alpha | Voltage-gated sodium channel subunit alpha Nav1.7
Type:
PROTEIN
Mol. Mass.:
225808.99
Organism:
Mus musculus
Description:
ChEMBL_109594
Residue:
1984
  
Inhibitor
Name:
BDBM76858
Synonyms:
US9546164, 580 | US9694002, 580
Type:
Small organic molecule
Emp. Form.:
C25H27ClF4N2O4S
Mol. Mass.:
563.004
SMILES:
CS(=O)(=O)NC(=O)c1cc(C2CC2)c(OCC2CCN(Cc3cc(ccc3Cl)C(F)(F)F)CC2)cc1F
: