Target
Sodium channel protein type 9 subunit alpha
Ligand
BDBM50505257
Substrate
Meas. Tech.
ChEMBL_1822256 (CHEMBL4322020)
Kd
14±n/a nM
Citation
 Mulcahy, JVPajouhesh, HBeckley, JTDelwig, ADu Bois, JHunter, JC Challenges and Opportunities for Therapeutics Targeting the Voltage-Gated Sodium Channel Isoform Na J Med Chem 62:8695-8710 (2019)  
Target
Name:
Sodium channel protein type 9 subunit alpha
Synonyms:
Kiaa4197 Peripheral sodium channel 1 Scn9a Sodium channel protein type IX subunit alpha | Voltage-gated sodium channel subunit alpha Nav1.7
Type:
PROTEIN
Mol. Mass.:
225808.99
Organism:
Mus musculus
Description:
ChEMBL_109594
Residue:
1984
  
Inhibitor
Name:
BDBM50505257
Synonyms:
CHEMBL4471012
Type:
Small organic molecule
Emp. Form.:
C24H25Cl2FN4O3S
Mol. Mass.:
539.45
SMILES:
C[C@@H](N1CC[C@H](C1)n1nc(C)c2cc(C(=O)NS(=O)(=O)C3CC3)c(F)cc12)c1cc(Cl)cc(Cl)c1
: