Target
Broad substrate specificity ATP-binding cassette transporter ABCG2
Ligand
BDBM50505458
Substrate
Meas. Tech.
ChEMBL_1822770 (CHEMBL4322534)
IC50
25±n/a nM
Citation
 Zhu, XWong, ILKChan, KFCui, JLaw, MCChong, TCHu, XChow, LMCChan, TH Triazole Bridged Flavonoid Dimers as Potent, Nontoxic, and Highly Selective Breast Cancer Resistance Protein (BCRP/ABCG2) Inhibitors. J Med Chem 62:8578-8608 (2019)  
Target
Name:
Broad substrate specificity ATP-binding cassette transporter ABCG2
Synonyms:
ABCG2 ABCP ATP-binding cassette sub-family G member 2 ATP-binding cassette, sub-family G, member 2 BCRP1 CDw338 Mitoxantrone resistance-associated protein Urate exporter
Type:
Multi-pass membrane protein; monomer or homodimer; disulfide-linked
Mol. Mass.:
72329.48
Organism:
Homo sapiens (Human)
Description:
Q9UNQ0
Residue:
655
  
Inhibitor
Name:
BDBM50505458
Synonyms:
CHEMBL4453052
Type:
Small organic molecule
Emp. Form.:
C66H56N6O14
Mol. Mass.:
1157.1826
SMILES:
COC(=O)c1cccc(COc2c(oc3ccccc3c2=O)-c2ccc(OCCOCCn3cc(nn3)-c3cccc(c3)-c3cn(CCOCCOc4ccc(cc4)-c4oc5ccccc5c(=O)c4OCc4cccc(c4)C(=O)OC)nn3)cc2)c1
: