Target
Serine/threonine-protein kinase BRSK1
Ligand
BDBM50505541
Substrate
Meas. Tech.
ChEMBL_1823012 (CHEMBL4322776)
Kd
109±n/a nM
Citation
 Hirozane, YToyofuku, MYogo, TTanaka, YSameshima, TMiyahisa, IYoshikawa, M Structure-based rational design of staurosporine-based fluorescent probe with broad-ranging kinase affinity for kinase panel application. Bioorg Med Chem Lett 29:0 (2019)  
Target
Name:
Serine/threonine-protein kinase BRSK1
Synonyms:
BR serine/threonine-protein kinase 1 BRSK1_HUMAN SAD1 Serine/threonine-protein kinase BRSK1 (BRSK1)
Type:
Enzyme Catalytic Domain
Mol. Mass.:
85119.02
Organism:
Homo sapiens (Human)
Description:
gi_24308326
Residue:
778
  
Inhibitor
Name:
BDBM50505541
Synonyms:
CHEMBL4465866
Type:
Small organic molecule
Emp. Form.:
C49H54BF2N7O7
Mol. Mass.:
901.804
SMILES:
[H][C@]12C[C@@H](NCCOCCOCCOCCNC(=O)CCC3=[N+]4C(C=C3)=Cc3c(C)cc(C)n3[B-]4(F)F)[C@@H](OC)[C@](C)(O1)n1c3ccccc3c3c4CNC(=O)c4c4c5ccccc5n2c4c13
: