Target
Protein kinase C epsilon type
Ligand
BDBM50057514
Substrate
Meas. Tech.
ChEMBL_161102 (CHEMBL771562)
Ki
1±n/a nM
Citation
 Kozikowski, APWang, SMa, DYao, JAhmad, SGlazer, RIBogi, KAcs, PModarres, SLewin, NEBlumberg, PM Modeling, chemistry, and biology of the benzolactam analogues of indolactam V (ILV). 2. Identification of the binding site of the benzolactams in the CRD2 activator-binding domain of PKCdelta and discovery of an ILV analogue of improved isozyme selectivity. J Med Chem 40:1316-26 (1997)  
Target
Name:
Protein kinase C epsilon type
Synonyms:
KPCE_HUMAN PKCE Protein kinase C epsilon Protein kinase C, PKC; classical/novel nPKC-epsilon
Type:
Enzyme
Mol. Mass.:
83680.45
Organism:
Homo sapiens (Human)
Description:
The recombinant human PKC enzymes were produced using a baculovirus expression system in SF9 cells
Residue:
737
  
Inhibitor
Name:
BDBM50057514
Synonyms:
(10S,13S)-13-Hydroxymethyl-10-isopropyl-9-methyl-5-octyl-3,9,12-triaza-tricyclo[6.6.1.0*4,15*]pentadeca-1,4,6,8(15)-tetraen-11-one CHEMBL285801
Type:
Small organic molecule
Emp. Form.:
C25H39N3O2
Mol. Mass.:
413.5961
SMILES:
CCCCCCCCc1ccc2N(C)[C@@H](C(C)C)C(=O)N[C@H](CO)Cc3c[nH]c1c23
: