Target
Nonstructural protein 5A
Ligand
BDBM50505984
Substrate
Meas. Tech.
ChEMBL_1824460 (CHEMBL4324224)
IC50
0.009±n/a nM
Citation
 Ramdas, VTalwar, RBanerjee, MJoshi, AADas, AKWalke, DSBorhade, PDhayagude, ULoriya, RGote, GBommakanti, ASivaram, AAgarwal, GGoswami, ANigade, PMehta, MPatil, VModi, DKumar, HMallurwar, SDash, AModi, FKuldharan, SSrivastava, PSingh, MNarasimham, LGundu, JSharma, SKamboj, RKPalle, VP Discovery and Characterization of Potent Pan-Genotypic HCV NS5A Inhibitors Containing Novel Tricyclic Central Core Leading to Clinical Candidate. J Med Chem 62:10563-10582 (2019)  
Target
Name:
Nonstructural protein 5A
Synonyms:
NS5A | Nonstructural protein 5A
Type:
PROTEIN
Mol. Mass.:
48587.20
Organism:
Hepatitis C virus
Description:
ChEMBL_108438
Residue:
447
  
Inhibitor
Name:
BDBM50505984
Synonyms:
CHEMBL4439465
Type:
Small organic molecule
Emp. Form.:
C42H52N8O6
Mol. Mass.:
764.9123
SMILES:
COC(=O)N[C@@H](C(C)C)C(=O)N1CCC[C@H]1c1ncc([nH]1)-c1ccc-2c(CCc3cc(ccc-23)-c2cnc([nH]2)[C@@H]2CCCN2C(=O)[C@@H](NC(=O)OC)C(C)C)c1
: