Target
Histone acetyltransferase p300
Ligand
BDBM50506372
Substrate
Meas. Tech.
ChEMBL_1825663 (CHEMBL4325427)
IC50
1.1±n/a nM
Citation
 Yang, YZhang, RLi, ZMei, LWan, SDing, HChen, ZXing, JFeng, HHan, JJiang, HZheng, MLuo, CZhou, B Discovery of Highly Potent, Selective, and Orally Efficacious p300/CBP Histone Acetyltransferases Inhibitors. J Med Chem 63:1337-1360 (2020)  
Target
Name:
Histone acetyltransferase p300
Synonyms:
EP300 HIF1A/p300/CREB-binding protein P300
Type:
Protein
Mol. Mass.:
264223.04
Organism:
Homo sapiens (Human)
Description:
Q09472
Residue:
2414
  
Inhibitor
Name:
BDBM50506372
Synonyms:
CHEMBL4475351
Type:
Small organic molecule
Emp. Form.:
C28H29FN4O5
Mol. Mass.:
520.5521
SMILES:
CNC(=O)Nc1ccc2c(CC[C@@]22OC(=O)N(CC(=O)N3Cc4ccc(F)cc4CC[C@H]3C3CC3)C2=O)c1
: