Target
Histone acetyltransferase p300
Ligand
BDBM50506381
Substrate
Meas. Tech.
ChEMBL_1825663 (CHEMBL4325427)
IC50
2.4±n/a nM
Citation
 Yang, YZhang, RLi, ZMei, LWan, SDing, HChen, ZXing, JFeng, HHan, JJiang, HZheng, MLuo, CZhou, B Discovery of Highly Potent, Selective, and Orally Efficacious p300/CBP Histone Acetyltransferases Inhibitors. J Med Chem 63:1337-1360 (2020)  
Target
Name:
Histone acetyltransferase p300
Synonyms:
EP300 HIF1A/p300/CREB-binding protein P300
Type:
Protein
Mol. Mass.:
264223.04
Organism:
Homo sapiens (Human)
Description:
Q09472
Residue:
2414
  
Inhibitor
Name:
BDBM50506381
Synonyms:
CHEMBL4450724
Type:
Small organic molecule
Emp. Form.:
C27H22F4N4O5
Mol. Mass.:
558.481
SMILES:
Cn1cc(cn1)-c1ccc2c(CC[C@@]22OC(=O)N(CC(=O)N3Cc4cc(F)ccc4OC[C@H]3C(F)(F)F)C2=O)c1
: