Target
Histone acetyltransferase p300
Ligand
BDBM50506380
Substrate
Meas. Tech.
ChEMBL_1825663 (CHEMBL4325427)
IC50
1.8±n/a nM
Citation
 Yang, YZhang, RLi, ZMei, LWan, SDing, HChen, ZXing, JFeng, HHan, JJiang, HZheng, MLuo, CZhou, B Discovery of Highly Potent, Selective, and Orally Efficacious p300/CBP Histone Acetyltransferases Inhibitors. J Med Chem 63:1337-1360 (2020)  
Target
Name:
Histone acetyltransferase p300
Synonyms:
EP300 HIF1A/p300/CREB-binding protein P300
Type:
Protein
Mol. Mass.:
264223.04
Organism:
Homo sapiens (Human)
Description:
Q09472
Residue:
2414
  
Inhibitor
Name:
BDBM50506380
Synonyms:
CHEMBL4587968
Type:
Small organic molecule
Emp. Form.:
C27H23F4N5O4
Mol. Mass.:
557.4962
SMILES:
Cn1cc(cn1)-c1ccc2c(CC[C@]22NC(=O)N(CC(=O)N3Cc4cc(F)ccc4OC[C@H]3C(F)(F)F)C2=O)c1
: