Target
Endothelial lipase
Ligand
BDBM50506501
Substrate
Meas. Tech.
ChEMBL_1825986 (CHEMBL4325750)
IC50
0.900000±n/a nM
Citation
 Tora, GKim, SHPi, ZJohnson, JAJiang, JPhillips, MLloyd, JAbell, LMLu, HLocke, GAdam, LPTaylor, DSYin, XBehnia, KZhao, LYang, RBasso, MCaporuscio, CChen, AYLiu, EKirshgessner, TOnorato, JMRyan, CTraeger, SCGordon, DWexler, RRFinlay, HJ Identification of Reversible Small Molecule Inhibitors of Endothelial Lipase (EL) That Demonstrate HDL-C Increase In Vivo. J Med Chem 63:1660-1670 (2020)  
Target
Name:
Endothelial lipase
Synonyms:
EDL Endothelial cell-derived lipase LIPG
Type:
Protein
Mol. Mass.:
56805.62
Organism:
Homo sapiens (Human)
Description:
Q9Y5X9
Residue:
500
  
Inhibitor
Name:
BDBM50506501
Synonyms:
CHEMBL4563019
Type:
Small organic molecule
Emp. Form.:
C22H18F2N6O6S2
Mol. Mass.:
564.542
SMILES:
NS(=O)(=O)NCc1nnc(o1)C(=O)c1nc2cc(F)c(cc2s1)-c1ccc(C(=O)N2CCOCC2)c(F)c1
: