Target
Mitogen-activated protein kinase 8
Ligand
BDBM50240612
Substrate
Meas. Tech.
ChEMBL_1827109 (CHEMBL4326983)
Kd
23000±n/a nM
Citation
 Schepetkin, IAKhlebnikov, AIPotapov, ASKovrizhina, ARMatveevskaya, VVBelyanin, MLAtochin, DNZanoza, SOGaidarzhy, NMLyakhov, SAKirpotina, LNQuinn, MT Synthesis, biological evaluation, and molecular modeling of 11H-indeno[1,2-b]quinoxalin-11-one derivatives and tryptanthrin-6-oxime as c-Jun N-terminal kinase inhibitors. Eur J Med Chem 161:179-191 (2019)  
Target
Name:
Mitogen-activated protein kinase 8
Synonyms:
JNK-46 JNK1-alpha-1 MK08_HUMAN PRKM8 SAPK1C c-Jun N-terminal kinase 1 c-Jun N-terminal kinase 1(JNK1) | c-Jun N-terminal kinase 2 (JNK2)
Type:
Enzyme
Mol. Mass.:
48297.57
Organism:
Homo sapiens (Human)
Description:
JNK-1 was purchased from Upstate Cell Signaling Solutions (formerly Upstate Biotechnology).
Residue:
427
  
Inhibitor
Name:
BDBM50240612
Synonyms:
CHEMBL306946 Indolo[2,1-b]quinazoline-6,12-dione TRYPTANTHRIN | US10669273, Compound 5a
Type:
Small organic molecule
Emp. Form.:
C15H8N2O2
Mol. Mass.:
248.2362
SMILES:
O=C1c2ccccc2-n2c1nc1ccccc1c2=O
: