Target
Mitogen-activated protein kinase 9
Ligand
BDBM50506716
Substrate
Meas. Tech.
ChEMBL_1827110 (CHEMBL4326984)
Kd
840±n/a nM
Citation
 Schepetkin, IAKhlebnikov, AIPotapov, ASKovrizhina, ARMatveevskaya, VVBelyanin, MLAtochin, DNZanoza, SOGaidarzhy, NMLyakhov, SAKirpotina, LNQuinn, MT Synthesis, biological evaluation, and molecular modeling of 11H-indeno[1,2-b]quinoxalin-11-one derivatives and tryptanthrin-6-oxime as c-Jun N-terminal kinase inhibitors. Eur J Med Chem 161:179-191 (2019)  
Target
Name:
Mitogen-activated protein kinase 9
Synonyms:
JNK-55 JNK2/JNK3 MK09_HUMAN Mitogen-activated protein kinase 8/9 SAPK1A c-Jun N-terminal kinase 2 | c-Jun N-terminal kinase 2 (JNK2)
Type:
Enzyme
Mol. Mass.:
48131.49
Organism:
Homo sapiens (Human)
Description:
JNK-2 was purchased from Upstate Cell Signaling Solutions (formerly Upstate Biotechnology).
Residue:
424
  
Inhibitor
Name:
BDBM50506716
Synonyms:
CHEMBL4521282
Type:
Small organic molecule
Emp. Form.:
C16H11N3O
Mol. Mass.:
261.278
SMILES:
Cc1ccc2nc3\C(=N/O)c4ccccc4-c3nc2c1
: