Target
BDNF/NT-3 growth factors receptor
Ligand
BDBM50240612
Substrate
Meas. Tech.
ChEMBL_1827121 (CHEMBL4326995)
Kd
7200±n/a nM
Citation
 Schepetkin, IAKhlebnikov, AIPotapov, ASKovrizhina, ARMatveevskaya, VVBelyanin, MLAtochin, DNZanoza, SOGaidarzhy, NMLyakhov, SAKirpotina, LNQuinn, MT Synthesis, biological evaluation, and molecular modeling of 11H-indeno[1,2-b]quinoxalin-11-one derivatives and tryptanthrin-6-oxime as c-Jun N-terminal kinase inhibitors. Eur J Med Chem 161:179-191 (2019)  
Target
Name:
BDNF/NT-3 growth factors receptor
Synonyms:
GP145-TrkB NTRK2 Neurotrophic tyrosine kinase receptor type 2 Trk-B Tropomyosin-related kinase B Tyrosine kinase receptor B (Trk-B)
Type:
Enzyme
Mol. Mass.:
91996.87
Organism:
Homo sapiens (Human)
Description:
Q16620
Residue:
822
  
Inhibitor
Name:
BDBM50240612
Synonyms:
CHEMBL306946 Indolo[2,1-b]quinazoline-6,12-dione TRYPTANTHRIN | US10669273, Compound 5a
Type:
Small organic molecule
Emp. Form.:
C15H8N2O2
Mol. Mass.:
248.2362
SMILES:
O=C1c2ccccc2-n2c1nc1ccccc1c2=O
: