Target
Amine oxidase [flavin-containing] B
Ligand
BDBM19187
Substrate
Meas. Tech.
ChEMBL_1827453 (CHEMBL4327327)
IC50
18±n/a nM
Citation
 Pisani, LIacobazzi, RMCatto, MRullo, MFarina, RDenora, NCellamare, SAltomare, CD Investigating alkyl nitrates as nitric oxide releasing precursors of multitarget acetylcholinesterase-monoamine oxidase B inhibitors. Eur J Med Chem 161:292-309 (2019)  
Target
Name:
Amine oxidase [flavin-containing] B
Synonyms:
AOFB_HUMAN MAOB Monoamine oxidase type B (MAO B) Monoamine oxidase type B (MAOB)
Type:
Protein
Mol. Mass.:
58768.76
Organism:
Homo sapiens (Human)
Description:
P27338
Residue:
520
  
Inhibitor
Name:
BDBM19187
Synonyms:
(2S)-2-[({4-[(3-fluorophenyl)methoxy]phenyl}methyl)amino]propanamide SAG US9051240, (S)-(+)-2-[4-(3-Fluorobenzyloxy)-benzylamino]-propanamide
Type:
Small organic molecule
Emp. Form.:
C17H19FN2O2
Mol. Mass.:
302.3434
SMILES:
[H][C@@](C)(NCc1ccc(OCc2cccc(F)c2)cc1)C(N)=O
: