Target
Wee1-like protein kinase
Ligand
BDBM50240826
Substrate
Meas. Tech.
ChEMBL_1828778 (CHEMBL4328652)
IC50
101±n/a nM
Citation
 Narayan, SRamisetti, SJaiswal, ASLaw, BKSingh-Pillay, ASingh, PAmin, SSharma, AK ASR352, A potent anticancer agent: Synthesis, preliminary SAR, and biological activities against colorectal cancer bulk, 5-fluorouracil/oxaliplatin resistant and stem cells. Eur J Med Chem 161:456-467 (2019)  
Target
Name:
Wee1-like protein kinase
Synonyms:
Serine/threonine-protein kinase WEE1 WEE1 homolog (S. pombe) | WEE1_HUMAN
Type:
PROTEIN
Mol. Mass.:
71599.12
Organism:
Homo sapiens (Human)
Description:
ChEMBL_1445054
Residue:
646
  
Inhibitor
Name:
BDBM50240826
Synonyms:
AZD-1775 US11124518, Example AZD1775 US11479555, Example AZD1775
Type:
Small organic molecule
Emp. Form.:
C27H32N8O2
Mol. Mass.:
500.5954
SMILES:
CN1CCN(CC1)c1ccc(Nc2ncc3c(n2)n(-c2cccc(n2)C(C)(C)O)n(CC=C)c3=O)cc1
: