Target
Envelope glycoprotein gp160
Ligand
BDBM50507073
Substrate
Meas. Tech.
ChEMBL_1828971 (CHEMBL4328845)
Ki
4700±n/a nM
Citation
 Zhou, GChu, SNemati, AHuang, CSnyder, BAPtak, RGGochin, M Investigation of the molecular characteristics of bisindole inhibitors as HIV-1 glycoprotein-41 fusion inhibitors. Eur J Med Chem 161:533-542 (2019)  
Target
Name:
Envelope glycoprotein gp160
Synonyms:
envelope glycoprotein
Type:
Enzyme Catalytic Domain
Mol. Mass.:
91798.58
Organism:
Human immunodeficiency virus 1
Description:
gi_45357394
Residue:
814
  
Inhibitor
Name:
BDBM50507073
Synonyms:
CHEMBL4592061
Type:
Small organic molecule
Emp. Form.:
C30H28N2O4
Mol. Mass.:
480.5543
SMILES:
Cc1cn(C(=O)OC(C)(C)C)c2cc(ccc12)-c1ccc2ccn(Cc3cccc(c3)C(O)=O)c2c1
: