Target
Polymerase basic protein 2
Ligand
BDBM50507246
Substrate
Meas. Tech.
ChEMBL_1829449 (CHEMBL4329323)
EC50
0.200000±n/a nM
Citation
 Xiong, JWang, JHu, GZhao, WLi, J Design, synthesis and biological evaluation of novel, orally bioavailable pyrimidine-fused heterocycles as influenza PB2 inhibitors. Eur J Med Chem 162:249-265 (2019)  
Target
Name:
Polymerase basic protein 2
Synonyms:
PB2 Polymerase basic protein 2 | RNA-directed RNA polymerase subunit P3
Type:
PROTEIN
Mol. Mass.:
86120.80
Organism:
Influenza A virus (strain A/Puerto Rico/8/1934 H1N1)
Description:
ChEMBL_109460
Residue:
759
  
Inhibitor
Name:
BDBM50507246
Synonyms:
CHEMBL4568323
Type:
Small organic molecule
Emp. Form.:
C22H20FN5O2S
Mol. Mass.:
437.49
SMILES:
OC(=O)[C@H]1C2CCC(CC2)[C@@H]1Nc1nc(nc2sccc12)-c1c[nH]c2ncc(F)cc12
: