Target
Lysine-specific histone demethylase 1A
Ligand
BDBM50507295
Substrate
Meas. Tech.
ChEMBL_1829544 (CHEMBL4329418)
Kd
243±n/a nM
Citation
 Ma, QSYao, YZheng, YCFeng, SChang, JYu, BLiu, HM Ligand-based design, synthesis and biological evaluation of xanthine derivatives as LSD1/KDM1A inhibitors. Eur J Med Chem 162:555-567 (2019)  
Target
Name:
Lysine-specific histone demethylase 1A
Synonyms:
AOF2 Flavin-containing amine oxidase domain-containing protein 2 KDM1A KIAA0601 Lysine-specific demethylase 1 (LSD1) Lysine-specific histone demethylase 1 (LSD1)
Type:
Enzyme
Mol. Mass.:
92901.01
Organism:
Homo sapiens (Human)
Description:
O60341
Residue:
852
  
Inhibitor
Name:
BDBM50507295
Synonyms:
CHEMBL1232432
Type:
Small organic molecule
Emp. Form.:
C27H38N6O2
Mol. Mass.:
478.6296
SMILES:
COc1cc2nc(NCCCN(C)C)nc(NC3CCN(Cc4ccccc4)CC3)c2cc1OC
: