Target
Carbonic anhydrase 9
Ligand
BDBM50092612
Substrate
Meas. Tech.
ChEMBL_1834732 (CHEMBL4334865)
Ki
12±n/a nM
Citation
 Mujumdar, PKopecka, JBua, SSupuran, CTRiganti, CPoulsen, SA Carbonic Anhydrase XII Inhibitors Overcome Temozolomide Resistance in Glioblastoma. J Med Chem 62:4174-4192 (2019)  
Target
Name:
Carbonic anhydrase 9
Synonyms:
CA-IX CAH9_HUMAN Carbonic anhydrase 9 (CA IX) Carbonic anhydrase 9 precursor Carbonic anhydrase IX (CAIX) Carbonic anhydrases; II & IX MN RCC-associated antigen G250
Type:
Enzyme
Mol. Mass.:
49669.03
Organism:
Homo sapiens (Human)
Description:
Catalytic domain of human cloned isozyme was used in the assay
Residue:
459
  
Inhibitor
Name:
BDBM50092612
Synonyms:
CHEMBL3586274
Type:
Small organic molecule
Emp. Form.:
C11H14BrN3O5S
Mol. Mass.:
380.215
SMILES:
NS(=O)(=O)CCNC(=O)C(\Cc1ccc(O)c(Br)c1)=N\O
: