Target
Carbonic anhydrase 2
Ligand
BDBM50092612
Substrate
Meas. Tech.
ChEMBL_1834731 (CHEMBL4334864)
Ki
88±n/a nM
Citation
 Mujumdar, PKopecka, JBua, SSupuran, CTRiganti, CPoulsen, SA Carbonic Anhydrase XII Inhibitors Overcome Temozolomide Resistance in Glioblastoma. J Med Chem 62:4174-4192 (2019)  
Target
Name:
Carbonic anhydrase 2
Synonyms:
CA-II CAC Carbonate dehydratase II Carbonic anhydrase 2 (CA-II) Carbonic anhydrase C Carbonic anhydrase II (CA-II) Carbonic anhydrase II (hCA II) | Carbonic anhydrase isoenzyme II (hCA II)
Type:
Enzyme
Mol. Mass.:
29250.71
Organism:
Homo sapiens (Human)
Description:
P00918
Residue:
260
  
Inhibitor
Name:
BDBM50092612
Synonyms:
CHEMBL3586274
Type:
Small organic molecule
Emp. Form.:
C11H14BrN3O5S
Mol. Mass.:
380.215
SMILES:
NS(=O)(=O)CCNC(=O)C(\Cc1ccc(O)c(Br)c1)=N\O
: