Target
Cysteine protease
Ligand
BDBM50509391
Substrate
Meas. Tech.
ChEMBL_1838249 (CHEMBL4338382)
Ki
0.500000±n/a nM
Citation
 Ettari, RPreviti, SMaiorana, SAmendola, GWagner, ACosconati, SSchirmeister, THellmich, UAZappalą, M Optimization Strategy of Novel Peptide-Based Michael Acceptors for the Treatment of Human African Trypanosomiasis. J Med Chem 62:10617-10629 (2019)  
Target
Name:
Cysteine protease
Synonyms:
Rhodesain
Type:
PROTEIN
Mol. Mass.:
48425.78
Organism:
Trypanosoma brucei rhodesiense
Description:
ChEMBL_619861
Residue:
450
  
Inhibitor
Name:
BDBM50509391
Synonyms:
CHEMBL4459413
Type:
Small organic molecule
Emp. Form.:
C31H34N2O4
Mol. Mass.:
498.6127
SMILES:
CCC(=O)\C=C\[C@H](CCc1ccccc1)NC(=O)[C@H](Cc1ccccc1)NC(=O)OCc1ccccc1
: