Target
TYR_PHOSPHATASE_2 domain-containing protein
Ligand
BDBM50509486
Substrate
Meas. Tech.
ChEMBL_1838490 (CHEMBL4338623)
Ki
7000±n/a nM
Citation
 Liu, ZWang, QLi, SCui, HSun, ZChen, DLu, YLiu, HZhang, W Polypropionate Derivatives with  J Nat Prod 82:3440-3449 (2019)  
Target
Name:
TYR_PHOSPHATASE_2 domain-containing protein
Synonyms:
(PROTEIN-TYROSINE-PHOSPHATASE) (PTPase) PHOSPHOTYROSINE PROTEIN PHOSPHATASE PTPB Phosphotyrosine-protein phosphatase PTPB | Protein Tyrosine Phosphatase PTPB
Type:
Hydrolase
Mol. Mass.:
30152.45
Organism:
Mycobacterium tuberculosis
Description:
Residue:
276
  
Inhibitor
Name:
BDBM50509486
Synonyms:
CHEMBL4443444
Type:
Small organic molecule
Emp. Form.:
C24H38O5
Mol. Mass.:
406.5555
SMILES:
CC[C@H](C)C[C@H](C)C[C@@H]1CO[C@H]([C@H](C)C1)C(\C)=C/C(=C/C=C/CC(O)=O)/C(O)=O
: