Target
Galectin-4
Ligand
BDBM50509528
Substrate
Meas. Tech.
ChEMBL_1838658 (CHEMBL4338791)
Kd
1300000±n/a nM
Citation
 Mahanti, MPal, KBSundin, APLeffler, HNilsson, UJ Epimers Switch Galectin-9 Domain Selectivity: 3 ACS Med Chem Lett 11:34-39 (2020)  
Target
Name:
Galectin-4
Synonyms:
Antigen NY-CO-27 L-36 lactose-binding protein LEG4_HUMAN Lactose-binding lectin 4
Type:
PROTEIN
Mol. Mass.:
35952.28
Organism:
Homo sapiens (Human)
Description:
ChEMBL_716454
Residue:
323
  
Inhibitor
Name:
BDBM50509528
Synonyms:
CHEMBL4474507
Type:
Small organic molecule
Emp. Form.:
C14H21NO6
Mol. Mass.:
299.3196
SMILES:
CO[C@@H]1O[C@H](CO)[C@H](O)[C@H](Nc2ccc(OC)cc2)[C@H]1O
: