Target
Cytochrome P450 3A4
Ligand
BDBM253135
Substrate
Meas. Tech.
ChEMBL_1839576 (CHEMBL4339791)
IC50
>20000±n/a nM
Citation
 Duan, JJLu, ZJiang, BStachura, SWeigelt, CASack, JSKhan, JRuzanov, MGalella, MAWu, DRYarde, MShen, DRShuster, DJBorowski, VXie, JHZhang, LVanteru, SGupta, AKMathur, AZhao, QFoster, WSalter-Cid, LMCarter, PHDhar, TGM Structure-based Discovery of Phenyl (3-Phenylpyrrolidin-3-yl)sulfones as Selective, Orally Active ROR?t Inverse Agonists. ACS Med Chem Lett 10:367-373 (2019)  
Target
Name:
Cytochrome P450 3A4
Synonyms:
Albendazole monooxygenase CP3A4_HUMAN CYP3A4 CYPIIIA4 Cytochrome P450 3A4 (CYP3A4) Nifedipine oxidase Taurochenodeoxycholate 6-alpha-hydroxylase
Type:
Enzyme
Mol. Mass.:
57349.57
Organism:
Homo sapiens (Human)
Description:
Residue:
503
  
Inhibitor
Name:
BDBM253135
Synonyms:
US9458171, 95
Type:
Small organic molecule
Emp. Form.:
C27H25F8NO5S
Mol. Mass.:
627.543
SMILES:
OC(=O)[C@H]1CC[C@@H](CC1)C(=O)N1CC[C@](C1)(c1ccc(cc1)C(F)(C(F)(F)F)C(F)(F)F)S(=O)(=O)c1ccc(F)cc1
: