Target
Prolyl 4-hydroxylase
Ligand
BDBM60875
Substrate
Meas. Tech.
ChEMBL_1840409 (CHEMBL4340708)
IC50
15900±n/a nM
Citation
 Langley, GWAbboud, MILohans, CTSchofield, CJ Inhibition of a viral prolyl hydroxylase. Bioorg Med Chem 27:2405-2412 (2019)  
Target
Name:
Prolyl 4-hydroxylase
Synonyms:
A085R | Prolyl 4-hydroxylase
Type:
PROTEIN
Mol. Mass.:
27815.10
Organism:
Paramecium bursaria Chlorella virus 1
Description:
ChEMBL_119118
Residue:
242
  
Inhibitor
Name:
BDBM60875
Synonyms:
3-((6-(4,5-Dihydro-1H-benzo[d]azepin-3(2H)-yl)-2-(pyridin-2-yl)pyrimidin-4-yl)amino)propanoic acid GSK J1 GSKJ1
Type:
Emp. Form.:
C22H23N5O2
Mol. Mass.:
389.4503
SMILES:
OC(=O)CCNc1cc(nc(n1)-c1ccccn1)N1CCc2ccccc2CC1
: