Target
Adenosine receptor A2a
Ligand
BDBM50064696
Substrate
Meas. Tech.
ChEMBL_90338 (CHEMBL696391)
IC50
8±n/a nM
Citation
 Baraldi, PGCacciari, BSpalluto, GBergonzoni, MDionisotti, SOngini, EVarani, KBorea, PA Design, synthesis, and biological evaluation of a second generation of pyrazolo[4,3-e]-1,2,4-triazolo[1,5-c]pyrimidines as potent and selective A2A adenosine receptor antagonists. J Med Chem 41:2126-33 (1998)  
Target
Name:
Adenosine receptor A2a
Synonyms:
A2A adenosine receptor (hA2A) ADENOSINE A2 ADORA2 Adenosine A2A receptor (A2AAR)
Type:
G Protein-Coupled Receptor (GPCR)
Mol. Mass.:
44716.46
Organism:
Homo sapiens (Human)
Description:
P29274
Residue:
412
  
Inhibitor
Name:
BDBM50064696
Synonyms:
7-(3-(benzo[d][1,3]dioxol-5-yl)propyl)-2-(furan-2-yl)-7H-pyrazolo[4,3-e][1,2,4]triazolo[1,5-c]pyrimidin-5-amine CHEMBL307748
Type:
Small organic molecule
Emp. Form.:
C20H17N7O3
Mol. Mass.:
403.3941
SMILES:
Nc1nc2n(CCCc3ccc4OCOc4c3)ncc2c2nc(nn12)-c1ccco1
: