Target
Adenosine receptor A3
Ligand
BDBM50064697
Substrate
Meas. Tech.
ChEMBL_30175 (CHEMBL642337)
Ki
>10000±n/a nM
Citation
 Baraldi, PGCacciari, BSpalluto, GBergonzoni, MDionisotti, SOngini, EVarani, KBorea, PA Design, synthesis, and biological evaluation of a second generation of pyrazolo[4,3-e]-1,2,4-triazolo[1,5-c]pyrimidines as potent and selective A2A adenosine receptor antagonists. J Med Chem 41:2126-33 (1998)  
Target
Name:
Adenosine receptor A3
Synonyms:
A3 adenosine receptor (hA3) ADORA3 | Adenosine A3 receptor (A3AR)
Type:
G Protein-Coupled Receptor (GPCR)
Mol. Mass.:
36197.32
Organism:
Homo sapiens (Human)
Description:
P0DMS8
Residue:
318
  
Inhibitor
Name:
BDBM50064697
Synonyms:
4-[3-(5-Amino-2-furan-2-yl-pyrazolo[4,3-e][1,2,4]triazolo[1,5-c]pyrimidin-7-yl)-propyl]-benzene-1,2-diol | CHEMBL63520
Type:
Small organic molecule
Emp. Form.:
C19H17N7O3
Mol. Mass.:
391.3834
SMILES:
Nc1nc2n(CCCc3ccc(O)c(O)c3)ncc2c2nc(nn12)-c1ccco1
: