Target
Adenosine receptor A1
Ligand
BDBM50064696
Substrate
Meas. Tech.
ChEMBL_29645 (CHEMBL639752)
Ki
1841±n/a nM
Citation
 Baraldi, PGCacciari, BSpalluto, GBergonzoni, MDionisotti, SOngini, EVarani, KBorea, PA Design, synthesis, and biological evaluation of a second generation of pyrazolo[4,3-e]-1,2,4-triazolo[1,5-c]pyrimidines as potent and selective A2A adenosine receptor antagonists. J Med Chem 41:2126-33 (1998)  
Target
Name:
Adenosine receptor A1
Synonyms:
AA1R_RAT ADENOSINE A1 high Adenosine A1 receptor (A1) Adenosine receptors A1 | Adora1
Type:
Protein
Mol. Mass.:
36704.13
Organism:
Rattus norvegicus (rat)
Description:
Residue:
326
  
Inhibitor
Name:
BDBM50064696
Synonyms:
7-(3-(benzo[d][1,3]dioxol-5-yl)propyl)-2-(furan-2-yl)-7H-pyrazolo[4,3-e][1,2,4]triazolo[1,5-c]pyrimidin-5-amine CHEMBL307748
Type:
Small organic molecule
Emp. Form.:
C20H17N7O3
Mol. Mass.:
403.3941
SMILES:
Nc1nc2n(CCCc3ccc4OCOc4c3)ncc2c2nc(nn12)-c1ccco1
: