Target
Adenosine receptor A1
Ligand
BDBM50064698
Substrate
Meas. Tech.
ChEMBL_29645 (CHEMBL639752)
Ki
1460±n/a nM
Citation
 Baraldi, PGCacciari, BSpalluto, GBergonzoni, MDionisotti, SOngini, EVarani, KBorea, PA Design, synthesis, and biological evaluation of a second generation of pyrazolo[4,3-e]-1,2,4-triazolo[1,5-c]pyrimidines as potent and selective A2A adenosine receptor antagonists. J Med Chem 41:2126-33 (1998)  
Target
Name:
Adenosine receptor A1
Synonyms:
AA1R_RAT ADENOSINE A1 high Adenosine A1 receptor (A1) Adenosine receptors A1 | Adora1
Type:
Protein
Mol. Mass.:
36704.13
Organism:
Rattus norvegicus (rat)
Description:
Residue:
326
  
Inhibitor
Name:
BDBM50064698
Synonyms:
7-[3-(4-Benzyloxy-phenyl)-propyl]-2-furan-2-yl-7H-pyrazolo[4,3-e][1,2,4]triazolo[1,5-c]pyrimidin-5-ylamine | CHEMBL423852
Type:
Small organic molecule
Emp. Form.:
C26H23N7O2
Mol. Mass.:
465.5065
SMILES:
Nc1nc2n(CCCc3ccc(OCc4ccccc4)cc3)ncc2c2nc(nn12)-c1ccco1
: