Target
Adenosine receptor A2a
Ligand
BDBM50064696
Substrate
Meas. Tech.
ChEMBL_30144 (CHEMBL640591)
Ki
3.8±n/a nM
Citation
 Baraldi, PGCacciari, BSpalluto, GBergonzoni, MDionisotti, SOngini, EVarani, KBorea, PA Design, synthesis, and biological evaluation of a second generation of pyrazolo[4,3-e]-1,2,4-triazolo[1,5-c]pyrimidines as potent and selective A2A adenosine receptor antagonists. J Med Chem 41:2126-33 (1998)  
Target
Name:
Adenosine receptor A2a
Synonyms:
AA2AR_RAT Adenosine A2 receptor Adenosine Receptors A2a (A2a) Adenosine receptors A2a Rat striatal adenosine A2a receptor
Type:
G Protein-Coupled Receptor (GPCR)
Mol. Mass.:
45015.65
Organism:
Rattus norvegicus (rat)
Description:
Rat A2A receptors expressed in CHO cells.
Residue:
410
  
Inhibitor
Name:
BDBM50064696
Synonyms:
7-(3-(benzo[d][1,3]dioxol-5-yl)propyl)-2-(furan-2-yl)-7H-pyrazolo[4,3-e][1,2,4]triazolo[1,5-c]pyrimidin-5-amine CHEMBL307748
Type:
Small organic molecule
Emp. Form.:
C20H17N7O3
Mol. Mass.:
403.3941
SMILES:
Nc1nc2n(CCCc3ccc4OCOc4c3)ncc2c2nc(nn12)-c1ccco1
: