Target
Neuraminidase
Ligand
BDBM50510687
Substrate
Meas. Tech.
ChEMBL_1842027 (CHEMBL4342326)
Ki
5000±n/a nM
Citation
 Zima, VAlbińana, CBRojíková, KPokorná, JPachl, P?ezá?ová, PHudlicky, JNavrátil, VMajer, PKonvalinka, JKo?í?ek, MMachara, A Investigation of flexibility of neuraminidase 150-loop using tamiflu derivatives in influenza A viruses H1N1 and H5N1. Bioorg Med Chem 27:2935-2947 (2019)  
Target
Name:
Neuraminidase
Synonyms:
Influenza A Virus Neuraminidase NRAM_I34A1 Neuraminidase A
Type:
Enzyme
Mol. Mass.:
50124.14
Organism:
Influenza A virus (A/Puerto Rico/8/34/Mount Sinai(H1N1))
Description:
P03468
Residue:
454
  
Inhibitor
Name:
BDBM50510687
Synonyms:
CHEMBL4460792
Type:
Small organic molecule
Emp. Form.:
C25H31F3N6O5
Mol. Mass.:
552.546
SMILES:
CCC(CC)O[C@@H]1C=C(C[C@@H]([C@H]1NC(C)=O)n1cc(CNc2ccc(C(N)=O)c(c2)C(F)(F)F)nn1)C(O)=O
: