Target
Arginase
Ligand
BDBM50510710
Substrate
Meas. Tech.
ChEMBL_1842051 (CHEMBL4342350)
IC50
>100000±n/a nM
Citation
 Feitosa, LMda Silva, ERHoelz, LVBSouza, DLCome, JAASSCardoso-Santos, CBatista, MMSoeiro, MNCBoechat, NPinheiro, LCS New pyrazolopyrimidine derivatives as Leishmania amazonensis arginase inhibitors. Bioorg Med Chem 27:3061-3069 (2019)  
Target
Name:
Arginase
Synonyms:
Type:
PROTEIN
Mol. Mass.:
36149.67
Organism:
Leishmania amazonensis
Description:
ChEMBL_107995
Residue:
329
  
Inhibitor
Name:
BDBM50510710
Synonyms:
CHEMBL4438412
Type:
Small organic molecule
Emp. Form.:
C12H10FN7S
Mol. Mass.:
303.318
SMILES:
NC(=S)NNc1ncnc2n(ncc12)-c1ccc(F)cc1
: