Target
Arginase
Ligand
BDBM50510706
Substrate
Meas. Tech.
ChEMBL_1842048 (CHEMBL4342347)
IC50
16500±n/a nM
Citation
 Feitosa, LMda Silva, ERHoelz, LVBSouza, DLCome, JAASSCardoso-Santos, CBatista, MMSoeiro, MNCBoechat, NPinheiro, LCS New pyrazolopyrimidine derivatives as Leishmania amazonensis arginase inhibitors. Bioorg Med Chem 27:3061-3069 (2019)  
Target
Name:
Arginase
Synonyms:
Type:
PROTEIN
Mol. Mass.:
36149.67
Organism:
Leishmania amazonensis
Description:
ChEMBL_107995
Residue:
329
  
Inhibitor
Name:
BDBM50510706
Synonyms:
CHEMBL4515068
Type:
Small organic molecule
Emp. Form.:
C8H8F3N7S
Mol. Mass.:
291.256
SMILES:
Cc1cc(NNC(N)=S)n2nc(nc2n1)C(F)(F)F
: