Target
Arginase
Ligand
BDBM50510711
Substrate
Meas. Tech.
ChEMBL_1842051 (CHEMBL4342350)
IC50
47000±n/a nM
Citation
 Feitosa, LMda Silva, ERHoelz, LVBSouza, DLCome, JAASSCardoso-Santos, CBatista, MMSoeiro, MNCBoechat, NPinheiro, LCS New pyrazolopyrimidine derivatives as Leishmania amazonensis arginase inhibitors. Bioorg Med Chem 27:3061-3069 (2019)  
Target
Name:
Arginase
Synonyms:
Type:
PROTEIN
Mol. Mass.:
36149.67
Organism:
Leishmania amazonensis
Description:
ChEMBL_107995
Residue:
329
  
Inhibitor
Name:
BDBM50510711
Synonyms:
CHEMBL4467463
Type:
Small organic molecule
Emp. Form.:
C13H10F3N7S
Mol. Mass.:
353.326
SMILES:
NC(=S)NNc1ncnc2n(ncc12)-c1ccc(cc1)C(F)(F)F
: