Target
Epithelial discoidin domain-containing receptor 1
Ligand
BDBM50511478
Substrate
Meas. Tech.
ChEMBL_1844885 (CHEMBL4345312)
Kd
7.8±n/a nM
Citation
 Mo, CZhang, ZLi, YHuang, MZou, JLuo, JTu, ZCXu, YRen, XDing, KLu, X Design and Optimization of 3'-(Imidazo[1,2- ACS Med Chem Lett 11:379-384 (2020)  
Target
Name:
Epithelial discoidin domain-containing receptor 1
Synonyms:
CAK DDR1_HUMAN Discoidin domain-containing receptor 1 (DDR1) EDDR1 Epithelial discoidin domain receptor 1 (DDR1) Epithelial discoidin domain-containing receptor 1 (DDR1) Mammary carcinoma kinase 10 NTRK4 Protein-tyrosine kinase RTK 6 TRKE | Tyrosine-protein kinase CAK
Type:
Tyrosine-protein kinase
Mol. Mass.:
101130.02
Organism:
Homo sapiens (Human)
Description:
Q08345
Residue:
913
  
Inhibitor
Name:
BDBM50511478
Synonyms:
CHEMBL4519003
Type:
Small organic molecule
Emp. Form.:
C29H22F4N4O
Mol. Mass.:
518.5048
SMILES:
CCc1ccc(cc1-c1cc(C)cc(c1)-c1cnc2cnccn12)C(=O)Nc1cc(F)cc(c1)C(F)(F)F
: