Target
Cyclin-dependent kinase 3/G1/S-specific cyclin-E1
Ligand
BDBM50113281
Substrate
Meas. Tech.
ChEMBL_1846233 (CHEMBL4346774)
IC50
360±n/a nM
Citation
 Tadesse, SCaldon, ECTilley, WWang, S Cyclin-Dependent Kinase 2 Inhibitors in Cancer Therapy: An Update. J Med Chem 62:4233-4251 (2019)  
Target
Name:
Cyclin-dependent kinase 3/G1/S-specific cyclin-E1
Synonyms:
CDK3/Cyclin E | CDK3/E
Type:
Protein
Mol. Mass.:
Description:
Components:
This complex has 2 components.
Component 1
Name:
Cyclin-dependent kinase 3
Synonyms:
CDK3 CDK3_HUMAN Cyclin-dependent kinase 3 | Cyclin-dependent kinase 3 (CDK3)
Type:
Enzyme
Mol. Mass.:
35053.88
Organism:
Homo sapiens (Human)
Description:
Q00526
Residue:
305
  
Component 2
Name:
G1/S-specific cyclin-E1
Synonyms:
CCNE CCNE1_HUMAN
Type:
Enzyme Subunit
Mol. Mass.:
47073.17
Organism:
Homo sapiens (Human)
Description:
Residue:
410
  
Inhibitor
Name:
BDBM50113281
Synonyms:
AT-7519
Type:
Small organic molecule
Emp. Form.:
C16H17Cl2N5O2
Mol. Mass.:
382.244
SMILES:
Clc1cccc(Cl)c1C(=O)Nc1c[nH]nc1C(=O)NC1CCNCC1
: