Target
Adenosine receptor A1
Ligand
BDBM50086170
Substrate
Meas. Tech.
ChEMBL_1846316 (CHEMBL4346857)
Ki
1.5±n/a nM
Citation
 Jiang, JSeel, CJTemirak, ANamasivayam, VArridu, ASchabikowski, JBaqi, YHinz, SHockemeyer, JMüller, CE A J Med Chem 62:4032-4055 (2019)  
Target
Name:
Adenosine receptor A1
Synonyms:
AA1R_MOUSE Adenosine receptor A1 | Adora1
Type:
PROTEIN
Mol. Mass.:
36646.06
Organism:
Mus musculus
Description:
ChEMBL_479902
Residue:
326
  
Inhibitor
Name:
BDBM50086170
Synonyms:
(4-Cyano-phenyl)-carbamic acid 4-(2,6-dioxo-1,3-dipropyl-2,3,6,7-tetrahydro-1H-purin-8-yl)-phenyl ester CHEMBL273807 N-(4-Cyano-phenyl)-2-[4-(2,6-dioxo-1,3-dipropyl-2,3,6,7-tetrahydro-1H-purin-8-yl)-phenoxy]-acetamide(MRS-1754) | N-(4-cyanophenyl)-2-(4-(2,6-dioxo-1,3-dipropyl-2,3,6,7-tetrahydro-1H-purin-8-yl)phenoxy)acetamide
Type:
Small organic molecule
Emp. Form.:
C26H26N6O4
Mol. Mass.:
486.5224
SMILES:
CCCn1c2nc([nH]c2c(=O)n(CCC)c1=O)-c1ccc(OCC(=O)Nc2ccc(cc2)C#N)cc1
: