Target
Calpain-1 catalytic subunit
Ligand
BDBM50066991
Substrate
Meas. Tech.
ChEMBL_43867 (CHEMBL658527)
IC50
7.0±n/a nM
Citation
 Tao, MBihovsky, RWells, GJMallamo, JP Novel peptidyl phosphorus derivatives as inhibitors of human calpain I. J Med Chem 41:3912-6 (1998)  
Target
Name:
Calpain-1 catalytic subunit
Synonyms:
CAN1_HUMAN CAPN1 Calpain-1 (u-Calpain) Calpain1
Type:
Protein
Mol. Mass.:
81880.51
Organism:
Homo sapiens (Human)
Description:
Residue:
714
  
Inhibitor
Name:
BDBM50066991
Synonyms:
(R)-2-(2-Benzyloxycarbonylamino-4-methyl-pentanoylamino)-4-methyl-pentanoic acid | CHEMBL127231
Type:
Small organic molecule
Emp. Form.:
C20H30N2O5
Mol. Mass.:
378.4626
SMILES:
CC(C)C[C@@H](NC(=O)C(CC(C)C)NC(=O)OCc1ccccc1)C(O)=O
: