Target
Baculoviral IAP repeat-containing protein 7
Ligand
BDBM50388975
Substrate
Meas. Tech.
ChEMBL_1850539 (CHEMBL4351163)
Kd
14±n/a nM
Citation
 Cong, HXu, LWu, YQu, ZBian, TZhang, WXing, CZhuang, C Inhibitor of Apoptosis Protein (IAP) Antagonists in Anticancer Agent Discovery: Current Status and Perspectives. J Med Chem 62:5750-5772 (2019)  
Target
Name:
Baculoviral IAP repeat-containing protein 7
Synonyms:
BIR3 BIRC7_HUMAN KIAP MLIAP | RNF50
Type:
PROTEIN
Mol. Mass.:
32792.04
Organism:
Homo sapiens (Human)
Description:
ChEMBL_624591
Residue:
298
  
Inhibitor
Name:
BDBM50388975
Synonyms:
CHEMBL2063869
Type:
Small organic molecule
Emp. Form.:
C25H34N6O3S
Mol. Mass.:
498.641
SMILES:
CN[C@@H](C)C(=O)N[C@@H](C1CCCCC1)C(=O)N1CCC[C@H]1C(=O)Nc1snnc1-c1ccccc1
: