Target
DNA-dependent protein kinase catalytic subunit
Ligand
BDBM350085
Substrate
Meas. Tech.
ChEMBL_1852128 (CHEMBL4352752)
Ki
>4000±n/a nM
Citation
 Knegtel, RCharrier, JDDurrant, SDavis, CO'Donnell, MStorck, PMacCormick, SKay, DPinder, JVirani, ATwin, HGriffiths, MReaper, PLittlewood, PYoung, SGolec, JPollard, J Rational Design of 5-(4-(Isopropylsulfonyl)phenyl)-3-(3-(4-((methylamino)methyl)phenyl)isoxazol-5-yl)pyrazin-2-amine (VX-970, M6620): Optimization of Intra- and Intermolecular Polar Interactions of a New Ataxia Telangiectasia Mutated and Rad3-Related (ATR) Kinase Inhibitor. J Med Chem 62:5547-5561 (2019)  
Target
Name:
DNA-dependent protein kinase catalytic subunit
Synonyms:
DNA-PK catalytic subunit DNA-dependent protein kinase (DNA-PK) DNA-dependent protein kinase catalytic subunit (DNA-PK) HYRC PRKDC | PRKDC_HUMAN
Type:
Protein
Mol. Mass.:
469114.78
Organism:
Homo sapiens (Human)
Description:
P78527
Residue:
4128
  
Inhibitor
Name:
BDBM350085
Synonyms:
3-[3-[4-[dideuterio(methylamino)methyl]phenyl]isoxazol-5-yl]-5-(4-isopropylsulfonylphenyl)pyrazin-2-amine US10208027, Compound II-1 US10208027, Compound II-3 US10479784, Compound IIA-7 US10961232, Compound IIA-7 | US11787781, Compound A
Type:
Small organic molecule
Emp. Form.:
C24H25N5O3S
Mol. Mass.:
463.552
SMILES:
CNCc1ccc(cc1)-c1cc(on1)-c1nc(cnc1N)-c1ccc(cc1)S(=O)(=O)C(C)C
: