Target
DNA-dependent protein kinase catalytic subunit
Ligand
BDBM50437436
Substrate
Meas. Tech.
ChEMBL_1852128 (CHEMBL4352752)
Ki
>4000±n/a nM
Citation
 Knegtel, RCharrier, JDDurrant, SDavis, CO'Donnell, MStorck, PMacCormick, SKay, DPinder, JVirani, ATwin, HGriffiths, MReaper, PLittlewood, PYoung, SGolec, JPollard, J Rational Design of 5-(4-(Isopropylsulfonyl)phenyl)-3-(3-(4-((methylamino)methyl)phenyl)isoxazol-5-yl)pyrazin-2-amine (VX-970, M6620): Optimization of Intra- and Intermolecular Polar Interactions of a New Ataxia Telangiectasia Mutated and Rad3-Related (ATR) Kinase Inhibitor. J Med Chem 62:5547-5561 (2019)  
Target
Name:
DNA-dependent protein kinase catalytic subunit
Synonyms:
DNA-PK catalytic subunit DNA-dependent protein kinase (DNA-PK) DNA-dependent protein kinase catalytic subunit (DNA-PK) HYRC PRKDC | PRKDC_HUMAN
Type:
Protein
Mol. Mass.:
469114.78
Organism:
Homo sapiens (Human)
Description:
P78527
Residue:
4128
  
Inhibitor
Name:
BDBM50437436
Synonyms:
CHEMBL2409216 | US8841450, I-1
Type:
Small organic molecule
Emp. Form.:
C22H22N4O3S
Mol. Mass.:
422.5
SMILES:
CC(C)S(=O)(=O)c1ccc(cc1)-c1cnc(N)c(n1)C1CC(=NO1)c1ccccc1
: