Target
Adenosine receptor A2a
Ligand
BDBM50513547
Substrate
Meas. Tech.
ChEMBL_1853617 (CHEMBL4354241)
EC50
0.640000±n/a nM
Citation
 Zhang, MFan, SZhou, XXie, FLi, SZhong, W Design, synthesis and biological evaluation of 2-hydrazinyladenosine derivatives as A Eur J Med Chem 179:310-324 (2019)  
Target
Name:
Adenosine receptor A2a
Synonyms:
A2A adenosine receptor (hA2A) ADENOSINE A2 ADORA2 Adenosine A2A receptor (A2AAR)
Type:
G Protein-Coupled Receptor (GPCR)
Mol. Mass.:
44716.46
Organism:
Homo sapiens (Human)
Description:
P29274
Residue:
412
  
Inhibitor
Name:
BDBM50513547
Synonyms:
CHEMBL4471366
Type:
Small organic molecule
Emp. Form.:
C31H31N7O6
Mol. Mass.:
597.6211
SMILES:
Nc1nc(N\N=C\c2ccc(OCc3ccccc3)c(OCc3ccccc3)c2)nc2n(cnc12)[C@@H]1O[C@H](CO)[C@@H](O)[C@H]1O
: