Target
Plasmepsin II
Ligand
BDBM50513825
Substrate
Meas. Tech.
ChEMBL_1854563 (CHEMBL4355292)
IC50
10.0±n/a nM
Citation
 Bobrovs, RJaudzems, KJirgensons, A Exploiting Structural Dynamics To Design Open-Flap Inhibitors of Malarial Aspartic Proteases. J Med Chem 62:8931-8950 (2019)  
Target
Name:
Plasmepsin II
Synonyms:
Aspartic hemoglobinase II PLM2_PLAFX Plasmepsin 2 Plasmepsin-II
Type:
Enzyme
Mol. Mass.:
51482.09
Organism:
Plasmodium falciparum
Description:
P46925
Residue:
453
  
Inhibitor
Name:
BDBM50513825
Synonyms:
CHEMBL4573790
Type:
Small organic molecule
Emp. Form.:
C34H36F3N3O4
Mol. Mass.:
607.6625
SMILES:
CN(CCc1ccccc1)C(=O)C1=C(CC2CN(CC1N2)C(C)=O)c1ccc(CCOc2cccc(OC(F)(F)F)c2)cc1
: