Target
Plasmepsin II
Ligand
BDBM50513836
Substrate
Meas. Tech.
ChEMBL_1854563 (CHEMBL4355292)
IC50
10.0±n/a nM
Citation
 Bobrovs, RJaudzems, KJirgensons, A Exploiting Structural Dynamics To Design Open-Flap Inhibitors of Malarial Aspartic Proteases. J Med Chem 62:8931-8950 (2019)  
Target
Name:
Plasmepsin II
Synonyms:
Aspartic hemoglobinase II PLM2_PLAFX Plasmepsin 2 Plasmepsin-II
Type:
Enzyme
Mol. Mass.:
51482.09
Organism:
Plasmodium falciparum
Description:
P46925
Residue:
453
  
Inhibitor
Name:
BDBM50513836
Synonyms:
CHEMBL4536043
Type:
Small organic molecule
Emp. Form.:
C36H43N3O3
Mol. Mass.:
565.7449
SMILES:
CC(C)c1ccccc1OCCc1ccc(cc1)C1=C(C2CN(CC(C1)N2)C(C)=O)C(=O)N(C)CCc1ccccc1
: