Target
Plasmepsin II
Ligand
BDBM50513855
Substrate
Meas. Tech.
ChEMBL_1854563 (CHEMBL4355292)
IC50
10.0±n/a nM
Citation
 Bobrovs, RJaudzems, KJirgensons, A Exploiting Structural Dynamics To Design Open-Flap Inhibitors of Malarial Aspartic Proteases. J Med Chem 62:8931-8950 (2019)  
Target
Name:
Plasmepsin II
Synonyms:
Aspartic hemoglobinase II PLM2_PLAFX Plasmepsin 2 Plasmepsin-II
Type:
Enzyme
Mol. Mass.:
51482.09
Organism:
Plasmodium falciparum
Description:
P46925
Residue:
453
  
Inhibitor
Name:
BDBM50513855
Synonyms:
CHEMBL4439654
Type:
Small organic molecule
Emp. Form.:
C34H39N3O4
Mol. Mass.:
553.6912
SMILES:
COc1cccc(OCCc2ccc(cc2)C2=C(C3CN(CC(C2)N3)C(C)=O)C(=O)N(C)CCc2ccccc2)c1
: