Target
Beta-hexosaminidase subunit beta
Ligand
BDBM50513940
Substrate
Meas. Tech.
ChEMBL_1855027 (CHEMBL4355756)
Ki
>10000±n/a nM
Citation
 Selnick, HGHess, JFTang, CLiu, KSchachter, JBBallard, JEMarcus, JKlein, DJWang, XPearson, MSavage, MJKaul, RLi, TSVocadlo, DJZhou, YZhu, YMu, CWang, YWei, ZBai, CDuffy, JLMcEachern, EJ Discovery of MK-8719, a Potent O-GlcNAcase Inhibitor as a Potential Treatment for Tauopathies. J Med Chem 62:10062-10097 (2019)  
Target
Name:
Beta-hexosaminidase subunit beta
Synonyms:
Beta-N-acetylhexosaminidase subunit beta Beta-hexosaminidase subunit beta (Hex B) HEXB_HUMAN | Hexosaminidase subunit B
Type:
Enzyme
Mol. Mass.:
63112.58
Organism:
Homo sapiens (Human)
Description:
P07686
Residue:
556
  
Inhibitor
Name:
BDBM50513940
Synonyms:
CHEMBL4586062
Type:
Small organic molecule
Emp. Form.:
C10H17FN2O3S
Mol. Mass.:
264.317
SMILES:
[H][C@]12O[C@H](CF)[C@@H](O)[C@H](O)[C@@]1([H])N=C(NCCC)S2
: