Target
Beta-hexosaminidase subunit beta
Ligand
BDBM205421
Substrate
Meas. Tech.
ChEMBL_1855027 (CHEMBL4355756)
Ki
>10000±n/a nM
Citation
 Selnick, HGHess, JFTang, CLiu, KSchachter, JBBallard, JEMarcus, JKlein, DJWang, XPearson, MSavage, MJKaul, RLi, TSVocadlo, DJZhou, YZhu, YMu, CWang, YWei, ZBai, CDuffy, JLMcEachern, EJ Discovery of MK-8719, a Potent O-GlcNAcase Inhibitor as a Potential Treatment for Tauopathies. J Med Chem 62:10062-10097 (2019)  
Target
Name:
Beta-hexosaminidase subunit beta
Synonyms:
Beta-N-acetylhexosaminidase subunit beta Beta-hexosaminidase subunit beta (Hex B) HEXB_HUMAN | Hexosaminidase subunit B
Type:
Enzyme
Mol. Mass.:
63112.58
Organism:
Homo sapiens (Human)
Description:
P07686
Residue:
556
  
Inhibitor
Name:
BDBM205421
Synonyms:
US9243020, 4 | US9815861, Example 4
Type:
Small organic molecule
Emp. Form.:
C9H16N2O3S
Mol. Mass.:
232.3
SMILES:
CN(C)C1=N[C@@H]2C[C@H](O)[C@@H](CO)O[C@@H]2S1
: