Target
Sphingosine kinase 1
Ligand
BDBM50514473
Substrate
Meas. Tech.
ChEMBL_1856908 (CHEMBL4357637)
EC50
>950±n/a nM
Citation
 Sibley, CDMorris, EAKharel, YBrown, AMHuang, TBevan, DRLynch, KRSantos, WL Discovery of a Small Side Cavity in Sphingosine Kinase 2 that Enhances Inhibitor Potency and Selectivity. J Med Chem 63:1178-1198 (2020)  
Target
Name:
Sphingosine kinase 1
Synonyms:
SK1 SPHK1 SPK Sphingosine kinase 1 (SPHK1) | Sphingosine kinase types 1 (SphK1)
Type:
Enzyme
Mol. Mass.:
42521.16
Organism:
Homo sapiens (Human)
Description:
Q9NYA1
Residue:
384
  
Inhibitor
Name:
BDBM50514473
Synonyms:
CHEMBL4453931
Type:
Small organic molecule
Emp. Form.:
C22H20ClF6N5O2
Mol. Mass.:
535.87
SMILES:
Cl.NC(=N)N1CCC[C@H]1c1nc(no1)-c1ccc(OCc2ccc(cc2)C(F)(F)F)c(c1)C(F)(F)F
: