Target
Sphingosine kinase 1
Ligand
BDBM50514476
Substrate
Meas. Tech.
ChEMBL_1856908 (CHEMBL4357637)
EC50
>1000±n/a nM
Citation
 Sibley, CDMorris, EAKharel, YBrown, AMHuang, TBevan, DRLynch, KRSantos, WL Discovery of a Small Side Cavity in Sphingosine Kinase 2 that Enhances Inhibitor Potency and Selectivity. J Med Chem 63:1178-1198 (2020)  
Target
Name:
Sphingosine kinase 1
Synonyms:
SK1 SPHK1 SPK Sphingosine kinase 1 (SPHK1) | Sphingosine kinase types 1 (SphK1)
Type:
Enzyme
Mol. Mass.:
42521.16
Organism:
Homo sapiens (Human)
Description:
Q9NYA1
Residue:
384
  
Inhibitor
Name:
BDBM50514476
Synonyms:
CHEMBL4466495
Type:
Small organic molecule
Emp. Form.:
C23H25ClF3N5O2
Mol. Mass.:
495.925
SMILES:
Cl.CCc1cc(ccc1OCc1ccc(cc1)C(F)(F)F)-c1noc(n1)[C@@H]1CCCN1C(N)=N
: