Target
Sphingosine kinase 1
Ligand
BDBM50514474
Substrate
Meas. Tech.
ChEMBL_1856908 (CHEMBL4357637)
EC50
>800±n/a nM
Citation
 Sibley, CDMorris, EAKharel, YBrown, AMHuang, TBevan, DRLynch, KRSantos, WL Discovery of a Small Side Cavity in Sphingosine Kinase 2 that Enhances Inhibitor Potency and Selectivity. J Med Chem 63:1178-1198 (2020)  
Target
Name:
Sphingosine kinase 1
Synonyms:
SK1 SPHK1 SPK Sphingosine kinase 1 (SPHK1) | Sphingosine kinase types 1 (SphK1)
Type:
Enzyme
Mol. Mass.:
42521.16
Organism:
Homo sapiens (Human)
Description:
Q9NYA1
Residue:
384
  
Inhibitor
Name:
BDBM50514474
Synonyms:
CHEMBL4462152
Type:
Small organic molecule
Emp. Form.:
C24H27ClF3N5O2
Mol. Mass.:
509.952
SMILES:
Cl.CCCc1cc(ccc1OCc1ccc(cc1)C(F)(F)F)-c1noc(n1)[C@@H]1CCCN1C(N)=N
: